{"text_format":"1","workbook":"xlsx","n_sheets":5,"sheets":["Lists","DATA","Results","KG Records","LB Records"],"not_rendered":{"charts":0,"images":0,"macros":1,"external_links":1,"defined_names":2,"comments":2,"pivot_tables":0},"unopened":[],"bounds":{"document_bytes":16777216,"sheet_cells":100000,"rows_first":2000,"rows_last":500,"rows_between":2000,"halvings":0,"cell_chars":16384,"cell_head_chars":4096},"cells_cut":0,"cells_raw":0,"read":"whole","date_system":"1900"}

{"sheet":"Lists","index":0,"n_rows":67,"n_cols":23,"rows_kept":67,"cut":false,"hidden":true,"merged":[]}
["Attempts",null,"col",null,{"$f":"MATCH(#REF!,Lists!F1:J1,0)","v":{"$error":"#REF!"}},"Powerlifting (3 lift meet)","Squat Only","Bench Press Only","Deadlift Only","Push Pull (Bench & Deadlift)",null,"column #","column Ltr",null,"Barload for Next Lifter"]
["Squat 1","SQ-1",11,null,{"$f":"OFFSET(E2,0,$E$1)","v":{"$error":"#REF!"}},"Squat 1","Squat 1","Bench Press 1","Deadlift 1","Bench Press 1",null,1,"A",null,null,{"$f":"#REF!","v":{"$error":"#REF!"}},null,null,null,null,null,null,"Y1"]
["Squat 2","SQ-2",12,null,{"$error":"#REF!"},"Squat 2","Squat 2","Bench Press 2","Deadlift 2","Bench Press 2",null,2,"B",null,null,{"$f":"ABS(Lists!B41)","v":{"$error":"#REF!"}},{"$f":"2*(Q6*P6+Q7*P7+Q8*P8+Q9*P9+Q10*P10+Q11*P11+Q12*P12+Q13*P13+Q14*P14+Q15*P15+Q16*P16)+Q35","v":{"$error":"#REF!"}},null,null,null,null,null,"Y2"]
["Squat 3","SQ-3",13,null,{"$error":"#REF!"},"Squat 3","Squat 3","Bench Press 3","Deadlift 3","Bench Press 3",null,3,"C",null,"How","Pound","LOAD",null,null,null,null,null,"Y3"]
["Bench Press 1","BP-1",16,null,{"$error":"#REF!"},"Bench Press 1","------------","------------","------------","Deadlift 1",null,4,"D",null,"Many?","Plates","on Bar",null,null,null,null,null,"T1"]
["Bench Press 2","BP-2",17,null,{"$error":"#REF!"},"Bench Press 2","New Lifter","New Lifter","New Lifter","Deadlift 2",null,5,"E",null,{"$f":"#REF!","v":{"$error":"#REF!"}},110,{"$f":"IF(OR(P3<Q35,P2=\"Kg\"),0,MIN(INT((P3-Q35)/(2*P6)),O6/2))","v":{"$error":"#REF!"}},{"$f":"IF(Q6=0,\"\",IF(Q6>1,CONCATENATE(Q6,\"/\",P6,\" \"),CONCATENATE(P6,\" \")))","v":{"$error":"#REF!"}},null,null,null,null,"T2"]
["Bench Press 3","BP-3",18,null,{"$error":"#REF!"},"Bench Press 3",null,null,null,"Deadlift 3",null,6,"F",null,{"$f":"#REF!","v":{"$error":"#REF!"}},100,{"$f":"IF(OR(P3<Q35,P2=\"Kg\"),0,MIN(INT((P3-Q35-2*Q6*P6)/(2*P7)),O7/2))","v":{"$error":"#REF!"}},{"$f":"IF(Q7=0,\"\",IF(Q7>1,CONCATENATE(Q7,\"/\",P7,\" \"),CONCATENATE(P7,\" \")))","v":{"$error":"#REF!"}},null,null,null,null,"T3"]
["Deadlift 1","DL-1",21,null,{"$error":"#REF!"},"Deadlift 1",null,null,null,"------------",null,7,"G",null,{"$f":"#REF!","v":{"$error":"#REF!"}},55,{"$f":"IF(OR(P3<Q35,P2=\"Kg\"),0,MIN(INT((P3-Q35-2*Q6*P6-2*Q7*P7)/(2*P8)),O8/2))","v":{"$error":"#REF!"}},{"$f":"IF(Q8=0,\"\",IF(Q8>1,CONCATENATE(Q8,\"/\",P8,\" \"),CONCATENATE(P8,\" \")))","v":{"$error":"#REF!"}},null,null,null,null,"JR"]
["Deadlift 2","DL-2",22,null,{"$error":"#REF!"},"Deadlift 2",null,null,null,"New Lifter",null,8,"H",null,{"$f":"#REF!","v":{"$error":"#REF!"}},45,{"$f":"IF(OR(P3<Q35,P2=\"Kg\"),0,MIN(INT((P3-Q35-2*Q6*P6-2*Q7*P7-2*Q8*P8)/(2*P9)),O9/2))","v":{"$error":"#REF!"}},{"$f":"IF(Q9=0,\"\",IF(Q9>1,CONCATENATE(Q9,\"/\",P9,\" \"),CONCATENATE(P9,\" \")))","v":{"$error":"#REF!"}},null,null,null,null,"O"]
["Deadlift 3","DL-3",23,null,{"$error":"#REF!"},"Deadlift 3",null,null,null,null,null,9,"I",null,{"$f":"#REF!","v":{"$error":"#REF!"}},35,{"$f":"IF(OR(P3<Q35,P2=\"Kg\"),0,MIN(INT((P3-Q35-2*Q6*P6-2*Q7*P7-2*Q8*P8-2*Q9*P9)/(2*P10)),O10/2))","v":{"$error":"#REF!"}},{"$f":"IF(Q10=0,\"\",IF(Q10>1,CONCATENATE(P10,\"/\",Q10,\" \"),CONCATENATE(P10,\" \")))","v":{"$error":"#REF!"}},null,null,null,null,"M1a"]
["------------",null,null,null,"------------","------------",null,null,null,null,null,10,"J",null,{"$f":"#REF!","v":{"$error":"#REF!"}},25,{"$f":"IF(OR(P3<Q35,P2=\"Kg\"),0,MIN(INT((P3-Q35-2*Q6*P6-2*Q7*P7-2*Q8*P8-2*Q9*P9-2*Q10*P10)/(2*P11)),O11/2))","v":{"$error":"#REF!"}},{"$error":"#REF!"},null,null,null,null,"M1b"]
["New Lifter",null,null,null,{"$f":"OFFSET(E12,0,$E$1)","v":{"$error":"#REF!"}},"New Lifter",null,null,null,null,null,11,"K",null,{"$f":"#REF!","v":{"$error":"#REF!"}},10,{"$f":"IF(OR(P3<Q35,P2=\"Kg\"),0,MIN(INT((P3-Q35-2*Q6*P6-2*Q7*P7-2*Q8*P8-2*Q9*P9-2*Q10*P10-2*Q11*P11)/(2*P12)),O12/2))","v":{"$error":"#REF!"}},{"$error":"#REF!"},null,null,null,null,"M2a"]
["Deadlift 2",null,null,null,null,null,null,null,null,null,null,12,"L",null,{"$f":"#REF!","v":{"$error":"#REF!"}},5,{"$f":"IF(OR(P3<Q35,P2=\"Kg\"),0,MIN(INT((P3-Q35-2*Q6*P6-2*Q7*P7-2*Q8*P8-2*Q9*P9-2*Q10*P10-2*Q11*P11-2*Q12*P12)/(2*P13)),O13/2))","v":{"$error":"#REF!"}},{"$error":"#REF!"},null,null,null,null,"M2b"]
["Weigh-in Macro values",null,null,null,null,null,null,null,null,null,null,13,"M",null,{"$f":"#REF!","v":{"$error":"#REF!"}},2.5,{"$f":"IF(OR(P3<Q35,P2=\"Kg\"),0,MIN(INT((P3-Q35-2*Q6*P6-2*Q7*P7-2*Q8*P8-2*Q9*P9-2*Q10*P10-2*Q11*P11-2*Q12*P12-2*Q13*P13)/(2*P14)),O14/2))","v":{"$error":"#REF!"}},{"$error":"#REF!"},null,null,null,null,"M3a"]
["Endrow (RowSort, EndSort for SQ1 BP1 DL1)",{"$f":"COUNTA(INDIRECT(\"Lifting!B13:B500\"))+12","v":13},null,null,null,null,null,null,null,null,null,14,"N",null,{"$f":"#REF!","v":{"$error":"#REF!"}},1.25,{"$f":"IF(OR(P3<Q35,P2=\"Kg\"),0,MIN(INT((P3-Q35-2*Q6*P6-2*Q7*P7-2*Q8*P8-2*Q9*P9-2*Q10*P10-2*Q11*P11-2*Q12*P12-2*Q13*P13-2*Q14*P14)/(2*P15)),O15/2))","v":{"$error":"#REF!"}},{"$error":"#REF!"},null,null,null,null,"M3b"]
["CopyRows",{"$f":"COUNTA(INDIRECT(\"'Weigh-In'!E1:E500\"))+1","v":2},null,null,null,null,null,null,null,null,null,15,"O",null,{"$f":"#REF!","v":{"$error":"#REF!"}},0.5,{"$f":"IF(OR(P3<Q35,P2=\"Kg\"),0,MIN(INT((P3-Q35-2*Q6*P6-2*Q7*P7-2*Q8*P8-2*Q9*P9-2*Q10*P10-2*Q11*P11-2*Q12*P12-2*Q13*P13-2*Q14*P14-2*Q15*P15)/(2*P16)),O16/2))","v":{"$error":"#REF!"}},{"$error":"#REF!"},null,null,null,null,"M4a"]
[null,null,null,null,null,null,null,null,null,null,null,16,"P",null,null,{"$f":"#REF!","v":{"$error":"#REF!"}},null,null,null,null,null,null,"M4b"]
["Lifting Sheet Macro Values",null,null,null,null,null,null,null,null,null,null,17,"Q",null,null,{"$f":"P3","v":{"$error":"#REF!"}},{"$f":"2*(Q21*P21+Q22*P22+Q23*P23+Q24*P24+Q25*P25+Q26*P26+Q27*P27+Q28*P28+Q29*P29+Q30*P30+Q31*P31)+Q36","v":{"$error":"#REF!"}},null,null,null,null,null,"M5a"]
["Lifting Sheet Sort","on",null,null,null,null,null,null,null,null,null,18,"R",null,"How","Kilo","LOAD",null,null,null,null,null,"M5b"]
["Lifting sheet row",13,null,null,null,null,null,null,null,null,null,19,"S",null,"Many?","Plates","on Bar",null,null,null,null,null,"M6"]
{"$rows_left_out":48}
{"sheet":"DATA","index":1,"n_rows":151,"n_cols":43,"rows_kept":151,"cut":false,"hidden":true,"merged":[[0,36,0,38],[0,40,0,42]]}
["Age","Coeff",null,null,"wt","IPF Men-kg","IPF women-kg",null,"wt class list","rank",null,"US State:","USAPL",null,"WT","HS Men-lb","HS Women-lb","WT","IPF Men-lb","IPF women-lb","wt","HS Men-kg","HS women-kg","wt","IPF Men-kg","IPF women-kg",null,"wt class rank kg","wt class rank lb","wt class rank kg",null,null,null,null,null,null,"USAPL Dvisions",null,null,null,"IPF Divisions"]
[14,1.23,"Foster",null,10,30,30,null,43,1,null,"Alabama","AL",null,88.186204599999996,114,97,22.045999999999999,66,66,10,52,44,10,30,30,null,30,66,30,null,"30-SQ","30-SQ","66-SQ",null,null,"FR-Y1","Raw Women (8-9)",1,null,"FR-SJr","Raw Women (14-18)",1]
[15,1.18,null,null,30.001000000000001,35,35,null,44,2,null,"Alaska","AK",null,97.004604599999993,114,105,66.140204600000004,77,77,44.000999999999998,52,48,30.001000000000001,35,35,null,35,77,35,null,"30-BP","30-BP","66-BP",null,null,"FR-Y2","Raw Women (10-11)",1,null,"FR-Jr","Raw Women (19-23)",1]
[16,1.1299999999999999,null,null,35.000999999999998,40,40,null,47,3,null,"Arizona","AZ",null,105.8230046,114,114,77.1632046,88,88,48.000999999999998,52,52,35.000999999999998,40,40,null,40,88,40,null,"30-DL","30-DL","66-DL",null,null,"FR-Y3","Raw Women (12-13)",1,null,"FR-O","Raw Women",1]
[17,1.08,null,null,40.000999999999998,44,43,null,48,4,null,"Arkansas","AR",null,114.6414046,123,123,88.186204599999996,97,94,52.000999999999998,56,56,40.000999999999998,44,43,null,43,94,43,null,"30-TL","30-TL","66-TL",null,null,"FR-T1","Raw Women (14-15)",1,null,"FR-M1","Raw Women (40-49)",1]
[18,1.06,null,null,43.000999999999998,44,47,null,52,5,null,"California","CA",null,123.4598046,132,132,94.800004599999994,97,103,56.000999999999998,60,60,43.000999999999998,44,47,null,44,97,44,null,"35-SQ","35-SQ","77-SQ",null,null,"FR-T2","Raw Women (16-17)",1,null,"FR-M2","Raw Women (50-59)",1]
[19,1.04,null,null,44.000999999999998,48,47,null,53,6,null,"Colorado","CO",null,132.27820460000001,148,148,97.004604599999993,105,103,60.000999999999998,67.5,67.5,44.000999999999998,48,47,null,47,103,47,null,"35-BP","35-BP","77-BP",null,null,"FR-T3","Raw Women (18-19)",1,null,"FR-M3","Raw Women (60-69)",1]
[20,1.03,null,null,47.000999999999998,48,52,null,56,7,null,"Connecticut","CT",null,148.81270460000002,165,165,103.61840460000001,105,114,67.501000000000005,75,75,47.000999999999998,48,52,null,48,105,48,null,"35-DL","35-DL","77-DL",null,null,"FR-JR","Raw Women (20-23)",1,null,"FR-M4","Raw Women (70+)-",1]
[21,1.02,null,null,48.000999999999998,53,52,null,57,8,null,"Delaware","DE",null,165.34720460000003,181,181,105.8230046,116,114,75.001000000000005,82.5,82.5,48.000999999999998,53,52,null,52,114,52,null,"35-TL","35-TL","77-TL",null,null,"FR-O","Raw Women",1,null,"MR-SJr","Raw Men (14-18)",1]
[22,1.01,null,null,52.000999999999998,53,57,null,59,9,null,"Florida","FL",null,181.88170460000001,198,198,114.6414046,116,125,82.501000000000005,90,90,52.000999999999998,53,57,null,53,116,53,null,"40-SQ","40-SQ","88-SQ",null,null,"FR-M1a","Raw Women (40-44)",1,null,"MR-Jr","Raw Men (19-23)",1]
[23,1,null,null,53.000999999999998,59,57,null,60,10,null,"Georgia","GA",null,198.41620460000001,220,"198+",116.8460046,130,125,90.001000000000005,100,"90+",53.000999999999998,59,57,null,56,123,56,null,"40-BP","40-BP","88-BP",null,null,"FR-M1b","Raw Women (45-49)",1,null,"MR-O","Raw Men",1]
[30,1,null,null,57.000999999999998,59,63,null,63,11,null,"Hawaii","HI",null,220.46220460000004,242,"198+",125.6644046,130,138,100.001,110,"90+",57.000999999999998,59,63,null,57,125,57,null,"40-DL","40-DL","88-DL",null,null,"FR-M2a","Raw Women (50-54)",1,null,"MR-M1","Raw Men (40-49)",1]
[40,1,"McCulloch",null,59.000999999999998,66,63,null,66,12,null,"Idaho","ID",null,242.50820460000003,275,"198+",130.07360460000001,130,138,110.001,125,"90+",59.000999999999998,66,63,null,59,130,59,null,"40-TL","40-TL","88-TL",null,null,"FR-M2b","Raw Women (55-59)",1,null,"MR-M2","Raw Men (50-59)",1]
[41,1.01,null,null,63.000999999999998,66,72,null,67.5,13,null,"Illinois","IL",null,275.57720460000002,"275+","198+",138.89200460000001,145,158,125.001,"125+","90+",63.000999999999998,66,72,null,60,132,60,null,"44-SQ","44-SQ","97-SQ",null,null,"FR-M3a","Raw Women (60-64)",1,null,"MR-M3","Raw Men (60-69)",1]
[42,1.02,null,null,66.001000000000005,74,72,null,72,14,null,"Indiana","IN",null,null,null,null,145.5058046,163,158,null,null,null,66.001000000000005,74,72,null,63,138,63,null,"44-BP","44-BP","97-BP",null,null,"FR-M3b","Raw Women (65-69)",1,null,"MR-M4","Raw Men (70+)-",1]
[43,1.0309999999999999,null,null,72.001000000000005,74,84,null,74,15,null,"Iowa","IA",null,null,null,null,158.73340460000003,163,185,null,null,null,72.001000000000005,74,84,null,66,145,66,null,"44-DL","44-DL","97-DL",null,null,"FR-M4a","Raw Women (70-74)",1,null,"F-SJr"," Women (14 -18)",1]
[44,1.0429999999999999,null,null,74.001000000000005,83,84,null,75,16,null,"Kansas","KS",null,null,null,null,163.14260460000003,183,185,null,null,null,74.001000000000005,83,84,null,67.5,148,67.5,null,"44-TL","44-TL","97-TL",null,null,"FR-M4b","Raw Women (75-79)",1,null,"F-Jr"," Women (19 -23)",1]
[45,1.0549999999999999,null,null,83.01,93,84,null,82.5,17,null,"Kentucky","KY",null,null,null,null,183.00384600000001,183,185,null,null,null,83.01,93,84,null,72,158,72,null,"48-SQ","48-SQ","105-SQ",null,null,"FR-M5a","Raw Women (80-84)",1,null,"F-O"," Women",1]
[46,1.0680000000000001,null,null,84.001000000000005,93,"84+",null,83,18,null,"Louisiana","LA",null,null,null,null,185.18860460000002,205,"185+",null,null,null,84.001000000000005,93,"84+",null,74,163,74,null,"48-BP","48-BP","105-BP",null,null,"FR-M5b","Raw Women (85-89)",1,null,"F-M1"," Women (40 -49)",1]
[47,1.0820000000000001,null,null,93.001000000000005,105,"84+",null,84,19,null,"Maine","ME",null,null,null,null,205.03000460000001,231,"185+",null,null,null,93.001000000000005,105,"84+",null,75,165,75,null,"48-DL","48-DL","105-DL",null,null,"FR-M6","Raw Women (90+)-",1,null,"F-M2"," Women (50 -59)",1]
{"$rows_left_out":132}
{"sheet":"Results","index":2,"n_rows":38,"n_cols":28,"rows_kept":38,"cut":false,"hidden":false,"merged":[[0,2,0,27]]}
[null,"2016-10-22","Noonan Barbell Raw Open - Alexandria, MN"]
["Flt C","Name","Div","Bwt - kg","IPF Wt Cls","Wilks Coeff","SQ rack","SQ-1","SQ-2","SQ-3","Best SQ","BP rack","BP-1","BP-2","BP-3","Best BP","Sub Total","DL-1","DL-2","DL-3","Best DL","PL Total","Pl/Div/Cls/Event","Age *Wilks","Wilks Pts","Age-Wilks","Pl Code","State"]
["A","Jessilyn Vizenor","FR-O",56.4,57,1.1700999736785889,"10",115,-120,120,120,"10_5",72.5,-77.5,77.5,77.5,197.5,132.5,-140,-140,132.5,330,"1/FR-O//PL",386.13299000000001,386.13299131393433,386.13299131393433,3,"MN"]
["A","Virginia Pilles","FR-O",75,84,0.9506000280380249,"13",132.5,145,160,160,"13_5",62.5,72.5,-75,72.5,232.5,132.5,150,165,165,397.5,"2/FR-O//PL",377.86351000000002,377.8635111451149,377.8635111451149,3,"MN"]
["A","Yvonne Hanley","FR-O",69.3,72,1.0017999410629272,"13",70,80,-87.5,80,"12_5",42.5,47.5,-52.5,47.5,127.5,95,102.5,110,110,237.5,"3/FR-O//PL",359.50844000000001,237.92748600244522,359.50843134969472,3,"MN"]
["A","Lindsay Youngquist","FR-O",67.2,72,1.023900032043457,"14",77.5,85,97.5,97.5,"14_6",50,57.5,62.5,62.5,160,112.5,127.5,142.5,142.5,302.5,"4/FR-O//PL",312.82706000000002,309.72975969314575,312.82705729007722,3,"MN"]
["A","Laura Heilman","FR-O",59.7,63,1.1191999912261963,"13",85,95,102.5,102.5,"12_5",42.5,50,-52.5,50,152.5,102.5,110,-120,110,262.5,"5/FR-O//PL",293.79000000000002,293.78999769687653,293.78999769687653,3,"MN"]
["A","JoAnn Schreffler","FR-O",71.2,72,0.98339998722076416,"14",85,87.5,-95,87.5,"10_6",65,-67.5,-67.5,65,152.5,115,117.5,-120,117.5,270,"6/FR-O//PL",265.51799999999997,265.51799654960632,265.51799654960632,3,"MN"]
["A","Amanda Lindstrom","FR-O",53.4,57,1.2211999893188477,"11",-95,-95,-95,0,"11_6",45,47.5,-52.5,47.5,0,92.5,97.5,102.5,102.5,0,"",0,0,0,3,"MN"]
["C","Cole Warren","MR-O",102.5,105,0.60280001163482666,"15",250,262.5,272.5,272.5,"14_6",170,177.5,-185,177.5,450,287.5,295,305,305,755,"1/MR-O//PL",468.76742999999999,455.11400878429413,468.76742904782299,3,"MN"]
["C","Nick Kolasa","MR-O",89.6,93,0.63980001211166382,"14",212.5,227.5,235,235,"13_6",147.5,157.5,162.5,162.5,397.5,232.5,250,260,260,657.5,"2/MR-O//PL",420.66851000000003,420.66850796341896,420.66850796341896,3,"MN"]
["C","Dalton Pfankuch","MR-O",73,74,0.72640001773834229,"14",200,-210,-210,200,"14_6",130,135,140,140,340,220,230,232.5,232.5,572.5,"3/MR-O//PL",415.86401000000001,415.86401015520096,415.86401015520096,3,"MN"]
["B","Cole Gau","MR-O",87,93,0.64990001916885376,"15",202.5,212.5,225,225,"12_6",137.5,145,-155,145,370,215,225,235,235,605,"4/MR-O//PL",408.91708999999997,393.18951159715652,408.91709206104281,3,"MN"]
["C","Micah  Rodahl","MR-O",93,93,0.6281999945640564,"17",237.5,252.5,262.5,262.5,"13_5",122.5,130,137.5,137.5,400,212.5,225,235,235,635,"5/MR-O//PL",398.90699999999998,398.90699654817581,398.90699654817581,3,"MN"]
["B","Aaron Poelaert","MR-O",69.8,74,0.75099998712539673,"13",182.5,187.5,200,200,"13_6",110,-120,-120,110,310,-220,-220,220,220,530,"6/MR-O//PL",398.02999,398.02999317646027,398.02999317646027,3,"MN"]
["C","Taylor Bones","MR-O",84.8,93,0.65920001268386841,"16",-215,-215,215,215,"14_5",-127.5,132.5,-140,132.5,347.5,247.5,-260,-260,247.5,595,"7/MR-O//PL",392.22401000000002,392.2240075469017,392.2240075469017,3,"MN"]
["C","Jeff Simondet","MR-O",86.7,93,0.65109997987747192,"17",185,205,-225,205,"15_6",135,142.5,-150,142.5,347.5,227.5,247.5,-272.5,247.5,595,"8/MR-O//PL",387.40449000000001,387.40448802709579,387.40448802709579,3,"MN"]
["B","Clay Davis","MR-O",72.599999999999994,74,0.72930002212524414,"16",172.5,180,182.5,182.5,"14_7",125,127.5,-130,127.5,310,212.5,220,-222.5,220,530,"9/MR-O//PL",386.52901000000003,386.52901172637939,386.52901172637939,3,"MN"]
["C","Saamuel Huber","MR-O",79.599999999999994,83,0.68489998579025269,"17",175,182.5,187.5,187.5,"13_6",135,142.5,-147.5,142.5,330,-210,210,-220,210,540,"10/MR-O//PL",384.63983000000002,369.84599232673645,384.63983201980591,3,"MN"]
["C","Matt Brouse","MR-O",132,"120+",0.56410002708435059,"20",220,230,-245,230,"17_7",160,165,170,170,400,252.5,260,-265,260,660,"11/MR-O//PL",372.30601999999999,372.30601787567139,372.30601787567139,3,"MN"]
{"$rows_left_out":19}
{"sheet":"KG Records","index":3,"n_rows":151,"n_cols":29,"rows_kept":151,"cut":false,"hidden":true,"merged":[]}
[null,"T1","T2","T3","JR","O","M1a","M1b","M2a","M2b","M3a","M3b","M4a","M4b","R-T1","R-T2","R-T3","R-Y1","R-Y2","R-Y3","R-JR","R-O","R-M1A","R-M1B","R-M2A","R-M2B","R-M3A","R-M3B","R-M4A"]
["30-SQ",0,0,0,0,0,0,0,0,0,0,0,0,0,0,0,0,0,0,0,0,0,0,0,0,0,0,0,0]
["30-BP",0,0,0,0,0,0,0,0,0,0,0,0,0,0,0,0,0,0,0,0,0,0,0,0,0,0,0,0]
["30-DL",0,0,0,0,0,0,0,0,0,0,0,0,0,0,0,0,0,0,0,0,0,0,0,0,0,0,0,0]
["30-TL",0,0,0,0,0,0,0,0,0,0,0,0,0,0,0,0,0,0,0,0,0,0,0,0,0,0,0,0]
["35-SQ",0,0,0,0,0,0,0,0,0,0,0,0,0,0,0,0,0,0,0,0,0,0,0,0,0,0,0,0]
["35-BP",0,0,0,0,0,0,0,0,0,0,0,0,0,0,0,0,0,0,0,0,0,0,0,0,0,0,0,0]
["35-DL",0,0,0,0,0,0,0,0,0,0,0,0,0,0,0,0,0,0,0,0,0,0,0,0,0,0,0,0]
["35-TL",0,0,0,0,0,0,0,0,0,0,0,0,0,0,0,0,0,0,0,0,0,0,0,0,0,0,0,0]
["40-SQ",0,0,0,0,0,0,0,0,0,0,0,0,0,0,0,0,0,0,0,0,0,0,0,0,0,0,0,0]
["40-BP",0,0,0,0,0,0,0,0,0,0,0,0,0,0,0,0,0,0,0,0,0,0,0,0,0,0,0,0]
["40-DL",0,0,0,0,0,0,0,0,0,0,0,0,0,0,0,0,0,0,0,0,0,0,0,0,0,0,0,0]
["40-TL",0,0,0,0,0,0,0,0,0,0,0,0,0,0,0,0,0,0,0,0,0,0,0,0,0,0,0,0]
["44-SQ",0,0,0,0,0,0,0,0,0,0,0,0,0,0,0,0,0,0,0,0,0,0,0,0,0,0,0,0]
["44-BP",0,0,0,0,0,0,0,0,0,0,0,0,0,0,0,0,0,0,0,0,0,0,0,0,0,0,0,0]
["44-DL",0,0,0,0,0,0,0,0,0,0,0,0,0,0,0,0,0,0,0,0,0,0,0,0,0,0,0,0]
["44-TL",0,0,0,0,0,0,0,0,0,0,0,0,0,0,0,0,0,0,0,0,0,0,0,0,0,0,0,0]
["48-SQ",0,0,0,0,0,0,0,0,0,0,0,0,0,0,0,0,0,0,0,0,0,0,0,0,0,0,0,0]
["48-BP",0,0,0,0,0,0,0,0,0,0,0,0,0,0,0,0,0,0,0,0,0,0,0,0,0,0,0,0]
["48-DL",0,0,0,0,0,0,0,0,0,0,0,0,0,0,0,0,0,0,0,0,0,0,0,0,0,0,0,0]
{"$rows_left_out":132}
{"sheet":"LB Records","index":4,"n_rows":151,"n_cols":29,"rows_kept":151,"cut":false,"hidden":true,"merged":[]}
[null,"T1","T2","T3","JR","O","M1a","M1b","M2a","M2b","M3a","M3b","M4a","M4b","R-T1","R-T2","R-T3","R-Y1","R-Y2","R-Y3","R-JR","R-O","R-M1A","R-M1B","R-M2A","R-M2B","R-M3A","R-M3B","R-M4A"]
["66-SQ",0,0,0,0,0,0,0,0,0,0,0,0,0,0,0,0,0,0,0,0,0,0,0,0,0,0,0,0]
["66-BP",0,0,0,0,0,0,0,0,0,0,0,0,0,0,0,0,0,0,0,0,0,0,0,0,0,0,0,0]
["66-DL",0,0,0,0,0,0,0,0,0,0,0,0,0,0,0,0,0,0,0,0,0,0,0,0,0,0,0,0]
["66-TL",0,0,0,0,0,0,0,0,0,0,0,0,0,0,0,0,0,0,0,0,0,0,0,0,0,0,0,0]
["77-SQ",0,0,0,0,0,0,0,0,0,0,0,0,0,0,0,0,0,0,0,0,0,0,0,0,0,0,0,0]
["77-BP",0,0,0,0,0,0,0,0,0,0,0,0,0,0,0,0,0,0,0,0,0,0,0,0,0,0,0,0]
["77-DL",0,0,0,0,0,0,0,0,0,0,0,0,0,0,0,0,0,0,0,0,0,0,0,0,0,0,0,0]
["77-TL",0,0,0,0,0,0,0,0,0,0,0,0,0,0,0,0,0,0,0,0,0,0,0,0,0,0,0,0]
["88-SQ",0,0,0,0,0,0,0,0,0,0,0,0,0,0,0,0,0,0,0,0,0,0,0,0,0,0,0,0]
["88-BP",0,0,0,0,0,0,0,0,0,0,0,0,0,0,0,0,0,0,0,0,0,0,0,0,0,0,0,0]
["88-DL",0,0,0,0,0,0,0,0,0,0,0,0,0,0,0,0,0,0,0,0,0,0,0,0,0,0,0,0]
["88-TL",0,0,0,0,0,0,0,0,0,0,0,0,0,0,0,0,0,0,0,0,0,0,0,0,0,0,0,0]
["97-SQ",0,0,0,0,0,0,0,0,0,0,0,0,0,0,0,0,0,0,0,0,0,0,0,0,0,0,0,0]
["97-BP",0,0,0,0,0,0,0,0,0,0,0,0,0,0,0,0,0,0,0,0,0,0,0,0,0,0,0,0]
["97-DL",0,0,0,0,0,0,0,0,0,0,0,0,0,0,0,0,0,0,0,0,0,0,0,0,0,0,0,0]
["97-TL",0,0,0,0,0,0,0,0,0,0,0,0,0,0,0,0,0,0,0,0,0,0,0,0,0,0,0,0]
["105-SQ",0,0,0,0,0,0,0,0,0,0,0,0,0,0,0,0,0,0,0,0,0,0,0,0,0,0,0,0]
["105-BP",0,0,0,0,0,0,0,0,0,0,0,0,0,0,0,0,0,0,0,0,0,0,0,0,0,0,0,0]
["105-DL",0,0,0,0,0,0,0,0,0,0,0,0,0,0,0,0,0,0,0,0,0,0,0,0,0,0,0,0]
{"$rows_left_out":131}